Results 1 to 100 on 182 for

"sims 4 initialization error at startup"

TopicsAuthorCreation dateReplies
I have no clue - nothing is working right and way too many pop upsI have no clue - nothing is working right and way too many pop upsnjgantt05-11-200951
How do I configure the browsers for startupHow do I configure the browsers for startupwayneb6424-09-20100
ERROR: Command execution failure. Please search the forum at http://clearspace.openqa.org for error details from the log window.  The error message is: Permission deniedERROR: Command execution failure. Please search the forum at http://clearspace.openqa.org for error details from the log window. The error message is: Permission deniedchirpari08-10-20101
No Desktop, Just Blue Screen At StartupNo Desktop, Just Blue Screen At Startupsamiles101-06-201118
Response_Code = -1 Error_Message = Request ErrorResponse_Code = -1 Error_Message = Request Errorutbipin15-11-20103
[error] Timed out after 30000ms[error] Timed out after 30000mszapotechi19-10-20098
Restore Windows Services To Default Startup SettingsRestore Windows Services To Default Startup SettingsFreeBooter26-12-20160
Win32/Nuqel.E and BankerFox.A VirusWin32/Nuqel.E and BankerFox.A VirusSilverLac30-08-20091
Error : Timed out after 30000msError : Timed out after 30000mssenthilm.aynara24-09-200915
Getting the error msg 'Error: Could not find or load main class java-jar' while executing the selenium code in eclipseGetting the error msg 'Error: Could not find or load main class java-jar' while executing the selenium code in eclipseMohammad Muqthiyar06-10-20122
[SOLVED] always says error wsclient.dll[SOLVED] always says error wsclient.dllmuharremerd28-12-20144
[ANSWERED] autorun.dll problem at uefi usb startup[ANSWERED] autorun.dll problem at uefi usb startupclodel26-10-20142
Facing the problem with recording.Facing the problem with recording.dileepreddys10-05-20122
XHR ERROR When accessing an URL (request_code = -1 ), test can not continueXHR ERROR When accessing an URL (request_code = -1 ), test can not continuemadisonli200703-08-20106
Timeout after 30000 ms (common Error)Timeout after 30000 ms (common Error)Amit Chhikara16-01-20124
Disable Startup Programs in Windows 8, 8.1 and Windows 10Disable Startup Programs in Windows 8, 8.1 and Windows 10FreeBooter12-02-20171
 Could not start Selenium session: Failed to start new browser session: Error while launching browser Could not start Selenium session: Failed to start new browser session: Error while launching browser divya_agsrdk19-01-201318
Hentai Sim Brothel 1 AppHentai Sim Brothel 1 AppKlangadin18-03-20120
Selenium RC; Permission denied on session.([error] Element not found ")Selenium RC; Permission denied on session.([error] Element not found ")Selenium_SQA06-11-20093
Getting error when i run selenium script in Eclipse, please helpGetting error when i run selenium script in Eclipse, please helpsanjayr23-07-20102
[SOLVED] error opening winreducer 10[SOLVED] error opening winreducer 10paulmav25-10-20142
Error: 'An error occurred executing the click atom' when i try to click an option Error: 'An error occurred executing the click atom' when i try to click an option dilbert_here01-06-20120
how to handle unexpected error in applcationhow to handle unexpected error in applcationsrilathap03-12-20121
selenium IDE selenium IDE sujata15-03-20111
how to capture time/number of results  in google results pagehow to capture time/number of results in google results pagemanukvk11-08-20104
[ANSWERED] WinReducer81.log[ANSWERED] WinReducer81.logwaldi8418-03-20146
How to import a python code in Selenium IDE, without error message?How to import a python code in Selenium IDE, without error message?kitty2417-04-20122
1073741819 error when playing TheHunter Primal1073741819 error when playing TheHunter PrimalOutlaw46122-02-20171
Start Selenium serverStart Selenium serverselenium.tesing23-09-20107
Hiscox's My StartUp Story Contest *usa only*Hiscox's My StartUp Story Contest *usa only*Admin28-09-20110
Error while using selenium over Xvfb (headless)Error while using selenium over Xvfb (headless)Dar25-03-20120
com.thoughtworks.selenium.SeleniumException: ERROR: Command execution failure.com.thoughtworks.selenium.SeleniumException: ERROR: Command execution failure.divya_agsrdk01-03-20132
Element not found error and quits in explorer / runs in firefoxElement not found error and quits in explorer / runs in firefoxrachita03-12-20091
Can I check the error message displayed or not in Selenium?Can I check the error message displayed or not in Selenium?gchandrasekaran8216-02-20110
browser runs minimized at startup in selenium  RCbrowser runs minimized at startup in selenium RCharendra03-02-20106
RESOLVED: Selenium Webdriver - SSL certificate error on IE8RESOLVED: Selenium Webdriver - SSL certificate error on IE8ashav03-03-20142
Reason for the error occurrence - "Element Not Found"Reason for the error occurrence - "Element Not Found"nobel14-04-20110
Error Code 118-0516 (Splatoon, Mario Kart 8)Error Code 118-0516 (Splatoon, Mario Kart 8)Nell TU31-05-20150
error: Selenium can not be resolvederror: Selenium can not be resolvedrohananvikar10-08-20121
Grid2: couldn't register this node : Error sending the registration  request.Grid2: couldn't register this node : Error sending the registration request.teiva15-09-20140
[ANSWERED] Error : Windows could not install the accepted licence terms onto the computer[ANSWERED] Error : Windows could not install the accepted licence terms onto the computergurfjkler06-12-201330
why do i get this errorwhy do i get this erroranbarasi25-01-20176
SearchIndexer.EXE error!!!SearchIndexer.EXE error!!!tarzan28-03-20096
HTTP ERROR: 404HTTP ERROR: 404dragan-sassler22-12-20090
Error while mounting ISOError while mounting ISOLearningToFly11-05-201610
mount errormount errordim27-01-20164
IE 11 upgrade Error  9c59IE 11 upgrade Error 9c59bottocino29-06-201615
Error in Windows 10 InstallationError in Windows 10 InstallationNunzyo9218-08-20159
[SOLVED] @{windows.immersivecontrolpanel_6.2.00} Error[SOLVED] @{windows.immersivecontrolpanel_6.2.00} Errorsum1saw07-11-201617
Replace the error imageReplace the error imageNiko17-05-20122
Validation for error in Selenium IDEValidation for error in Selenium IDEalenan201513-02-20152
C# Anti-Forgery error!?C# Anti-Forgery error!?l3l0023-02-20152
[ANSWERED] error with path[ANSWERED] error with pathdron4820-08-20163
Error: Firefox already runningError: Firefox already runningivsureshiv15-04-20111
[BUG] we are have a console error in Arabic Forums [BUG] we are have a console error in Arabic Forums omarpop2309-09-20161
Constant Script error IE11Constant Script error IE11hemp2214-10-201511
[ANSWERED] Page file error[ANSWERED] Page file errorastrogirl19-01-20153
ESD Converter Aborts with Error After 10 SecondsESD Converter Aborts with Error After 10 Secondsxanadu7301-02-201610
new winreducer version -> update.xml errornew winreducer version -> update.xml errorKrX21-04-20151
Error have been detected during downloading updates!!Error have been detected during downloading updates!!arslanbobo404-06-20171
[SOLVED]  Error[SOLVED] Errorrami725028-03-20143
Error to export testcase for EclipseError to export testcase for Eclipsejunior001418-09-20160
Error Loading Opperating SystemError Loading Opperating SystemConnelly9008-06-20104
Access Denied Error in Selenium RCAccess Denied Error in Selenium RCravinderreddy27-12-20131
Error while running a test in RubyError while running a test in Rubyzen_test129-05-20100
500 Error_Message = Internal Server Error500 Error_Message = Internal Server ErrorDukSerduk14-04-20100
[SOLVED] error: This folder is incorrect! [SOLVED] error: This folder is incorrect! greenworld14-11-201413
[ANSWERED] error with autounattend.xml[ANSWERED] error with autounattend.xmlqbert7914-01-20154
[solved] Features cleanup - Net Framework 3.5 Error[solved] Features cleanup - Net Framework 3.5 ErrorMr.T18-12-201413
Can anyone help me to resolve the cache error in selenium webdriver?Can anyone help me to resolve the cache error in selenium webdriver?gkpandi30-05-20132
[ANSWERED] Continue to get the error Unhandled Exception.[ANSWERED] Continue to get the error Unhandled Exception.theprophetsharbinger08-05-20155
[SOLVED] WinReducer 7 - v2.99.4.0 - GdiPlus.dll Error[SOLVED] WinReducer 7 - v2.99.4.0 - GdiPlus.dll Errorbabyboom66616-04-20143
Bios error 105 unsupported wireless card.Bios error 105 unsupported wireless card.roadran32227-02-201116
Removal of Windows Firewall causes error 0x80070035Removal of Windows Firewall causes error 0x80070035Kasch20-03-20154
Error messages from Malwarebytes Anti-MalwareError messages from Malwarebytes Anti-Malwaredlbaz620-11-20095
[SOLVED] win10 ex-100 bug systemsetting.exe runtime error[SOLVED] win10 ex-100 bug systemsetting.exe runtime errordecompiler27-02-20172
[SOLVED] iso Updated SCANNOW error[SOLVED] iso Updated SCANNOW errormodjo30-03-20179
[SOLVED] winreducer error befor openfile[SOLVED] winreducer error befor openfileKrX21-07-20144
[jQ plugin] GoogleURLShortener - Rút gọn liên kết sử dụng Google URL Shortener API[jQ plugin] GoogleURLShortener - Rút gọn liên kết sử dụng Google URL Shortener APIZzbaivong29-04-20144
Why seleniumserverstandlone 2.25.0..jar  getting stop? and getting error  in eclipse, Could not start Selenium sessionWhy seleniumserverstandlone 2.25.0..jar getting stop? and getting error in eclipse, Could not start Selenium sessiondivya_agsrdk06-02-201319
[SOLVED] .Wccf file locked/read only error[SOLVED] .Wccf file locked/read only errorspidernz06-03-20141
Error 130:9 (Licensing for this product has stopped working) - AdobeError 130:9 (Licensing for this product has stopped working) - AdobeDoctor Inferno25-06-20090
fatal error code stop :c000021a, 0xc0000034fatal error code stop :c000021a, 0xc0000034karenpintexas17-08-20101
Internet Explorer Script Error -- g_Logger is undefinedInternet Explorer Script Error -- g_Logger is undefinedeuphemia02-04-20098
Issue: com.thoughtworks.selenium.SeleniumExcepion: ERROR Server Exception: A result was unexpectedly found in the result holdrIssue: com.thoughtworks.selenium.SeleniumExcepion: ERROR Server Exception: A result was unexpectedly found in the result holdrvijayalakshmi_nr21-02-20111
WINDOWS 7 ERROR CODE: c0000135 cannot find %hs file is missing...WINDOWS 7 ERROR CODE: c0000135 cannot find %hs file is missing...madmac28315-05-201212
[SOLVED] Error occures If Hide Wlan Setup is selected [SOLVED] Error occures If Hide Wlan Setup is selected KrX11-09-20146
Error 148:3 (Licensing for this product has stopped working) - Adobe SoftwaresError 148:3 (Licensing for this product has stopped working) - Adobe SoftwaresDoctor Inferno04-04-20096
Removing Virus VirutRemoving Virus VirutCoreTUNA23-12-20092
Selenium will not see displayed screen even though browser displayes it - random errorSelenium will not see displayed screen even though browser displayes it - random errorhaughtonomous12-06-20130
Start Selenium RC server with cmd line option that never stop even it encounters errorStart Selenium RC server with cmd line option that never stop even it encounters errorsenthilm.aynara24-09-20092
Error message being displayed while running a code in Java (JUnit4) in selenium Rc .Error message being displayed while running a code in Java (JUnit4) in selenium Rc .Sanghamitra01-02-20130
[SOLVED] removing Optimize Drives Service cause error when shrinking partition[SOLVED] removing Optimize Drives Service cause error when shrinking partitionKrX29-01-201511
Selenium Webdriver: Unable to Locate element Link method errorSelenium Webdriver: Unable to Locate element Link method errorjegan03-01-20132
printer spool error and Malwarebytes website blocking options not workingprinter spool error and Malwarebytes website blocking options not workinglanset26-11-201316
Error in clickAnd Wait command in IDEError in clickAnd Wait command in IDEdivya_agsrdk31-01-20134
driver.switchTo().defaultContent();   returning error when using latest version of Chromedriver.switchTo().defaultContent(); returning error when using latest version of ChromeBarryMcDermott10-06-20150
Windows Vista Service Pack 2 installation failed error code: 80070490Windows Vista Service Pack 2 installation failed error code: 80070490smayracing9226-07-20102
Review: Thomas Was Alone (Wii U eShop) (PAL Region)Review: Thomas Was Alone (Wii U eShop) (PAL Region)Reanfan19-12-20146
Selenium-RC Test suite issueSelenium-RC Test suite issuesallu.iet21-04-201024
Results 1 to 100 on 182 for
"sims 4 initialization error at startup"
Active topics
Active topics
Popular topics
Popular topics
Unanswered topics
Unanswered topics
Pages
12