Results 101 to 200 on 308 for

"the sims 3 error code 12"

TopicsAuthorCreation dateReplies
[Hỏi đáp] Sai code header[Hỏi đáp] Sai code headerKTV226-10-20153
[Góp ý] Cải tiến thừa khung Code của Devs[Góp ý] Cải tiến thừa khung Code của Devsloving9you04-05-20163
How to write in FCK editor in selenium RC by using java code.How to write in FCK editor in selenium RC by using java code.Jazz04-08-20091
Error while running a test in RubyError while running a test in Rubyzen_test129-05-20100
Error to export testcase for EclipseError to export testcase for Eclipsejunior001418-09-20160
Constant Script error IE11Constant Script error IE11hemp2214-10-201511
[SOLVED]  Error[SOLVED] Errorrami725028-03-20143
[BUG] we are have a console error in Arabic Forums [BUG] we are have a console error in Arabic Forums omarpop2309-09-20161
[ANSWERED] Page file error[ANSWERED] Page file errorastrogirl19-01-20153
Error Loading Opperating SystemError Loading Opperating SystemConnelly9008-06-20104
new winreducer version -> update.xml errornew winreducer version -> update.xml errorKrX21-04-20151
[SOLVED] error: This folder is incorrect! [SOLVED] error: This folder is incorrect! greenworld14-11-201413
500 Error_Message = Internal Server Error500 Error_Message = Internal Server ErrorDukSerduk14-04-20100
ESD Converter Aborts with Error After 10 SecondsESD Converter Aborts with Error After 10 Secondsxanadu7301-02-201610
Error have been detected during downloading updates!!Error have been detected during downloading updates!!arslanbobo404-06-20171
Access Denied Error in Selenium RCAccess Denied Error in Selenium RCravinderreddy27-12-20131
Adding a second row under forum title & js codeAdding a second row under forum title & js codeblindbat145703-11-201036
CSS Code for adding icon before specific username? (PHPBB2)CSS Code for adding icon before specific username? (PHPBB2)pimentel211-10-20109
Nintendos QR code Misstep leads family to Pornography.Nintendos QR code Misstep leads family to Pornography.KingreX3217-02-20125
[solved] Features cleanup - Net Framework 3.5 Error[solved] Features cleanup - Net Framework 3.5 ErrorMr.T18-12-201413
[SOLVED] iso Updated SCANNOW error[SOLVED] iso Updated SCANNOW errormodjo30-03-20179
[ANSWERED] Continue to get the error Unhandled Exception.[ANSWERED] Continue to get the error Unhandled Exception.theprophetsharbinger08-05-20155
Bios error 105 unsupported wireless card.Bios error 105 unsupported wireless card.roadran32227-02-201116
[ANSWERED] error with autounattend.xml[ANSWERED] error with autounattend.xmlqbert7914-01-20154
Removal of Windows Firewall causes error 0x80070035Removal of Windows Firewall causes error 0x80070035Kasch20-03-20154
[SOLVED] winreducer error befor openfile[SOLVED] winreducer error befor openfileKrX21-07-20144
Can anyone help me to resolve the cache error in selenium webdriver?Can anyone help me to resolve the cache error in selenium webdriver?gkpandi30-05-20132
Error messages from Malwarebytes Anti-MalwareError messages from Malwarebytes Anti-Malwaredlbaz620-11-20095
[SOLVED] WinReducer 7 - v2.99.4.0 - GdiPlus.dll Error[SOLVED] WinReducer 7 - v2.99.4.0 - GdiPlus.dll Errorbabyboom66616-04-20143
How to create an original top navbarHow to create an original top navbarNiko21-03-201225
How to write selenium java code for doubleClick on a record using webdriverHow to write selenium java code for doubleClick on a record using webdrivernarenderm09-08-20120
Error 130:9 (Licensing for this product has stopped working) - AdobeError 130:9 (Licensing for this product has stopped working) - AdobeDoctor Inferno25-06-20090
[SOLVED] .Wccf file locked/read only error[SOLVED] .Wccf file locked/read only errorspidernz06-03-20141
[jQ plugin] GoogleURLShortener - Rút gọn liên kết sử dụng Google URL Shortener API[jQ plugin] GoogleURLShortener - Rút gọn liên kết sử dụng Google URL Shortener APIZzbaivong29-04-20144
Why seleniumserverstandlone 2.25.0..jar  getting stop? and getting error  in eclipse, Could not start Selenium sessionWhy seleniumserverstandlone 2.25.0..jar getting stop? and getting error in eclipse, Could not start Selenium sessiondivya_agsrdk06-02-201319
Internet Explorer Script Error -- g_Logger is undefinedInternet Explorer Script Error -- g_Logger is undefinedeuphemia02-04-20098
Issue: com.thoughtworks.selenium.SeleniumExcepion: ERROR Server Exception: A result was unexpectedly found in the result holdrIssue: com.thoughtworks.selenium.SeleniumExcepion: ERROR Server Exception: A result was unexpectedly found in the result holdrvijayalakshmi_nr21-02-20111
Stast Code JQuery…Stast Code JQuery…aSky08-10-201016
Selenium will not see displayed screen even though browser displayes it - random errorSelenium will not see displayed screen even though browser displayes it - random errorhaughtonomous12-06-20130
Removing Virus VirutRemoving Virus VirutCoreTUNA23-12-20092
Error 148:3 (Licensing for this product has stopped working) - Adobe SoftwaresError 148:3 (Licensing for this product has stopped working) - Adobe SoftwaresDoctor Inferno04-04-20096
[SOLVED] Error occures If Hide Wlan Setup is selected [SOLVED] Error occures If Hide Wlan Setup is selected KrX11-09-20146
how find no unread and emails in a gmail how find no unread and emails in a gmail viresh.sb08-04-20123
Selenium Webdriver: Unable to Locate element Link method errorSelenium Webdriver: Unable to Locate element Link method errorjegan03-01-20132
[SOLVED] removing Optimize Drives Service cause error when shrinking partition[SOLVED] removing Optimize Drives Service cause error when shrinking partitionKrX29-01-201511
Start Selenium RC server with cmd line option that never stop even it encounters errorStart Selenium RC server with cmd line option that never stop even it encounters errorsenthilm.aynara24-09-20092
driver.switchTo().defaultContent();   returning error when using latest version of Chromedriver.switchTo().defaultContent(); returning error when using latest version of ChromeBarryMcDermott10-06-20150
Error in clickAnd Wait command in IDEError in clickAnd Wait command in IDEdivya_agsrdk31-01-20134
[Đóng góp] Share Code Thống Kê Bài Viết Zone-fm Version 3.0[Đóng góp] Share Code Thống Kê Bài Viết Zone-fm Version 3.0Thanhkent29-06-20162
New Nintendo DSi colors arriving later this weekNew Nintendo DSi colors arriving later this weekSkywardL01-08-20128
Selenium-RC Test suite issueSelenium-RC Test suite issuesallu.iet21-04-201024
Script Execution using AndroidDriverScript Execution using AndroidDriverJeffNigl15-02-20121
error in eclipse java.lang.RuntimeException: Could not start Selenium session: null error in eclipse java.lang.RuntimeException: Could not start Selenium session: null divya_agsrdk11-02-201317
Selenium.SeleniumException : Failed to start new browser session: Error while launching browserSelenium.SeleniumException : Failed to start new browser session: Error while launching browserchinnarajuk127-06-20111
[TUTs] zzChat - Chatbox forumvi - v0.2[TUTs] zzChat - Chatbox forumvi - v0.2Zzbaivong18-08-201469
[TUTs] Tạo tiền tố tự động theo tên chuyên mục khi gửi bài[TUTs] Tạo tiền tố tự động theo tên chuyên mục khi gửi bàiZzbaivong30-11-201386
Fix Code 1073741819 from C:\Windows\Systems\Services.exeFix Code 1073741819 from C:\Windows\Systems\Services.exezero244211-09-200911
[TUTs] zzPrettify v2 - Khung code cho diễn đàn chuyên nghiệp[TUTs] zzPrettify v2 - Khung code cho diễn đàn chuyên nghiệpZzbaivong08-03-201428
WebArtz Newsletter Vol. 18WebArtz Newsletter Vol. 18Fatal Dawn18-08-20119
[Hỏi đáp] Giúp mình khắc phục lỗi Chatbox tự động xóa tin nhắn cũ.[Hỏi đáp] Giúp mình khắc phục lỗi Chatbox tự động xóa tin nhắn cũ.Mom0231511-12-20142
How do I get one page element in another page using Selenium Webdriver(java code)How do I get one page element in another page using Selenium Webdriver(java code)narenderm09-08-20120
[Thùng rác] Chống F12 Cool New  2015[Thùng rác] Chống F12 Cool New 2015Healer02-03-20150
[Hỏi đáp] Tạo điều kiện cho box[Hỏi đáp] Tạo điều kiện cho boxduythanh7319-10-201412
Unable to enter text into the Code mirro text boxUnable to enter text into the Code mirro text boxShanthuday16-12-20140
[SOLVED] Error Integrate 16-Apr-2014 KB2959977[SOLVED] Error Integrate 16-Apr-2014 KB2959977ibus0018-04-20141
[Urgent]Unable to run the Script on SharpDevelop...[Urgent]Unable to run the Script on SharpDevelop...lokesh_chandra01-06-20110
[Solved] Your file not mounted corcectly ERROR[Solved] Your file not mounted corcectly ERRORbroda3004-03-201417
IE 8.0 giving error messages on websites saying it is not version 8.0IE 8.0 giving error messages on websites saying it is not version 8.0cheryllweiner14-09-20111
Dirty volume!!Dirty volume!!shall196425-05-20097
I get error "Sorry, but only users granted special access can read topics in this forum"I get error "Sorry, but only users granted special access can read topics in this forum"ViciousPassion04-07-20128
[SOLVED] Error while downloading extra Software needed for WinReducer[SOLVED] Error while downloading extra Software needed for WinReducerhauser.markus25-09-20159
XPath idwntification probkemXPath idwntification probkemGuest08-02-20135
how to change this in the chatboxhow to change this in the chatboxmedlsc23-04-20126
The Denpa Men 2: Beyond the Waves review (3DS eShop)The Denpa Men 2: Beyond the Waves review (3DS eShop)Gamergy12-05-201435
[SOLVED] WinReducer EX-81  v1.4.1.0   error downloading windows updates[SOLVED] WinReducer EX-81 v1.4.1.0 error downloading windows updatestcg10-05-20162
[TestNG] [ERROR]  Cannot find class in classpath: Project class name[TestNG] [ERROR] Cannot find class in classpath: Project class nameJyotsana01-03-20170
[SOLVED] ERROR - Windows could not parse or process the unattend answer file for pass [specialize][SOLVED] ERROR - Windows could not parse or process the unattend answer file for pass [specialize]andreidi27-11-20145
Error in selenium ide when i execute verifyTextPresent after clickAndWait commandError in selenium ide when i execute verifyTextPresent after clickAndWait commanddivya_agsrdk19-01-20132
Error in adding test case to test suite.Error in adding test case to test suite.divya_agsrdk24-01-20131
Dynamic DIV HomepageDynamic DIV HomepageCanvasInc14-08-201247
Trying to read from excel file with JUnit but get error message "The constructor SpreadsheetData(InputStream) refers to the missing type InvalidFormatException"Trying to read from excel file with JUnit but get error message "The constructor SpreadsheetData(InputStream) refers to the missing type InvalidFormatException"AndersK31-03-20151
[Tips] DNS tên miền vào Forumotion và Đăng ký tên miền *.tk miễn phí 12 tháng[Tips] DNS tên miền vào Forumotion và Đăng ký tên miền *.tk miễn phí 12 thángKirigayaKazuto27-11-201343
eShop: Rival Turf is Hitting the North American Wii U eShop Tomorrow!eShop: Rival Turf is Hitting the North American Wii U eShop Tomorrow!Ichigofan27-05-20150
Cefaly....Cefaly....CluelessKitty18-10-201020
how to use these methods 	getAllFields() ,getElementPositionTop and getElementPositionLeft?how to use these methods getAllFields() ,getElementPositionTop and getElementPositionLeft?ramaswamy30-11-20113
SystemRoot apparently not set! error messageSystemRoot apparently not set! error messagerachita04-12-20092
[Help] Java input Username field as a timestamp[Help] Java input Username field as a timestampXps8813-11-20122
How to write in excelHow to write in excelmhroy26-08-20102
Service Code 1073741819Service Code 1073741819Hannabella8615-12-20099
Need key word driven and Hybrid frame work in web driverNeed key word driven and Hybrid frame work in web driverArahant13-03-20122
How to open a link in another tab of the same window using Selenium webdriver using Java code?How to open a link in another tab of the same window using Selenium webdriver using Java code?mfsi_Sudhansu07-11-20121
[Hỏi đáp] Khung hide biến thành giao diện khung code[Hỏi đáp] Khung hide biến thành giao diện khung codeMr_Hai05-01-20147
Wii Classic Controllers Have Been Discontinued By NintendoWii Classic Controllers Have Been Discontinued By NintendoClαππαd09-04-20144
[Hỏi đáp] Giúp về mod đăng ký nhanh cho forumvi[Hỏi đáp] Giúp về mod đăng ký nhanh cho forumvitanvking22-06-201518
Selenium RC with NUnit throwing error - File does not exist. File 'c:\Projects\WebDriver\trunk\src\Selenium.Core\HttpCommandProcessor.cs'Selenium RC with NUnit throwing error - File does not exist. File 'c:\Projects\WebDriver\trunk\src\Selenium.Core\HttpCommandProcessor.cs'Syed26-09-20110
Error with AlertError with AlertBera31-08-20091
How to use verifyAttributeHow to use verifyAttributeswethamani14-10-20111
Feature: Top 5 Most Bizarre Characters In Zelda!Feature: Top 5 Most Bizarre Characters In Zelda!Reanfan08-05-201311
Windows Error Reporting is disabled - C:\ProgramData\Microsoft\Windows\WER is still growingWindows Error Reporting is disabled - C:\ProgramData\Microsoft\Windows\WER is still growinglivingsilver9401-01-20150
Super FEXP Master TopicSuper FEXP Master TopicKlokinator14-02-201349
Results 101 to 200 on 308 for
"the sims 3 error code 12"
Active topics
Active topics
Popular topics
Popular topics
Unanswered topics
Unanswered topics
Pages
1234