Results 101 to 179 on 179 for

"sims 4 initialization error at startup"

TopicsAuthorCreation dateReplies
[TestNG] [ERROR]  Cannot find class in classpath: Project class name[TestNG] [ERROR] Cannot find class in classpath: Project class nameJyotsana01-03-20170
Itunes Installation Failure...Itunes Installation Failure...arkyma0713-02-20128
[SOLVED] ERROR - Windows could not parse or process the unattend answer file for pass [specialize][SOLVED] ERROR - Windows could not parse or process the unattend answer file for pass [specialize]andreidi27-11-20145
Error in adding test case to test suite.Error in adding test case to test suite.divya_agsrdk24-01-20131
Error in selenium ide when i execute verifyTextPresent after clickAndWait commandError in selenium ide when i execute verifyTextPresent after clickAndWait commanddivya_agsrdk19-01-20132
Error : I could not able to switch parent window to overlay window because that it throws No element exception found. We are using the webdriver :- 2.45.1  Please some one can help to resolve this issue, thanks in advance.Error : I could not able to switch parent window to overlay window because that it throws No element exception found. We are using the webdriver :- 2.45.1 Please some one can help to resolve this issue, thanks in advance.priya_periasamy16-03-20152
[SOLVED] WinReducer EX-81  v1.4.1.0   error downloading windows updates[SOLVED] WinReducer EX-81 v1.4.1.0 error downloading windows updatestcg10-05-20162
Error with AlertError with AlertBera31-08-20091
How to use verifyAttributeHow to use verifyAttributeswethamani14-10-20111
Feature: Top 5 Most Bizarre Characters In Zelda!Feature: Top 5 Most Bizarre Characters In Zelda!Reanfan08-05-201311
Windows Error Reporting is disabled - C:\ProgramData\Microsoft\Windows\WER is still growingWindows Error Reporting is disabled - C:\ProgramData\Microsoft\Windows\WER is still growinglivingsilver9401-01-20150
No Boot on New Toshiba with Windows 7No Boot on New Toshiba with Windows 7AdkWoody25-11-20109
Error 148:3 (Licensing for this product has stopped working) - Adobe SoftwaresError 148:3 (Licensing for this product has stopped working) - Adobe SoftwaresDoctor Inferno04-04-20096
RCINT failure String table ID not foundRCINT failure String table ID not foundChristie Andre29-12-20100
[SOLVED] Winreducer 7.0.316 Config errors[SOLVED] Winreducer 7.0.316 Config errorsdbwr718-02-20153
Entry Point Error MessageEntry Point Error MessageDon Dammeyer15-09-20091
Cannot update Router FirmwareCannot update Router FirmwareCrashOverride923-12-20105
[SOLVED] Windows 10 TP 10041 installation Error *loop*[SOLVED] Windows 10 TP 10041 installation Error *loop*xithyl31-03-201547
Selenium-Servr_2_5_0.jar throws error in RemoteControlConfigurationSelenium-Servr_2_5_0.jar throws error in RemoteControlConfigurationmanvya31-08-20110
c# webdriver - Data Driven : DataSource attribute error - Connecting Automation with MTMc# webdriver - Data Driven : DataSource attribute error - Connecting Automation with MTMl3l0005-03-20152
WinReducer 8.1 - v2.x.x.xWinReducer 8.1 - v2.x.x.xwinterstorm205023-06-2014206
Where is the TakesScreenshot.getScreenshotAs implementationWhere is the TakesScreenshot.getScreenshotAs implementationtrouserification03-12-20120
SCRIPTED DIAGNOSTICS NATIVE HOST HAS STOPPED WORKINGSCRIPTED DIAGNOSTICS NATIVE HOST HAS STOPPED WORKINGmegatails524-02-20140
[SOLVED] Bad Pool Header error [SOLVED] Bad Pool Header error iahaleem02-03-20143
selenium rc in iexploreselenium rc in iexplorePoonam1203199001-02-20134
Reporting results with Selenium IDEReporting results with Selenium IDEPlant_extract01-02-20131
[error] Could not connect to Selenium Server. Have you started the Selenium Server yet?[error] Could not connect to Selenium Server. Have you started the Selenium Server yet?vishal_sakharkar07-09-20160
Identifying the elementIdentifying the elementbull18-12-200914
how to record a test case in javascripthow to record a test case in javascriptfeuser11-10-20122
How to verify the graph?How to verify the graph?hnt_308031-05-20110
chrome driver with seleniumchrome driver with seleniumsreekumar07-01-201210
When Xpath not working...When Xpath not working...zea13-11-20092
How to capture the dialog box values using the selenium IDEHow to capture the dialog box values using the selenium IDEdhinesh12-06-20134
Pop-up issue with Selenium RC in IE7 testingPop-up issue with Selenium RC in IE7 testingHadesPluto25-09-20093
Cannot click on buttonCannot click on buttonTrillian06-04-201216
How to capture the errors handling in Selenium RC using C# , Testframework: Nunit?How to capture the errors handling in Selenium RC using C# , Testframework: Nunit?suren28-08-20121
Console Window Host Console Window Host hookem605704-10-20122
Page load issuePage load issuesnehal mulay18-03-20114
The Denpa Men 2 DiscussionThe Denpa Men 2 DiscussionSuperVash09-07-20131
Fatal error :  Failed To Locate Necessary Table(s) To Make AdjustmentsFatal error : Failed To Locate Necessary Table(s) To Make Adjustmentslonelywolf9005-06-20101
Beginner Selinium WebdriverBeginner Selinium WebdriverPatrick8612-01-20120
User-Extension IssueUser-Extension Issueumashankar24-11-20110
[ANSWERED] Simple CMD Code for Convert ESDWiM[ANSWERED] Simple CMD Code for Convert ESDWiMhome7ech17-01-20150
Element cannot be found with xpath expressionElement cannot be found with xpath expressionSellj28-09-20122
[ANSWERED] you are trying to use unsupported  windows upgrade dvd[ANSWERED] you are trying to use unsupported windows upgrade dvdzesh_ii03-03-201416
Windows 10 TP Build 10049Windows 10 TP Build 10049Hen Ry31-03-201514
[SOLVED] Setup Fails After Wireless Join[SOLVED] Setup Fails After Wireless JoinDevNet07-01-20143
"MaAgent.exe - entry point not found" error message"MaAgent.exe - entry point not found" error messageMaradona22-09-201232
[ANSWERED] When i try to open a iso, I have  "This folder is incorrect"[ANSWERED] When i try to open a iso, I have "This folder is incorrect"plauchon12-01-201412
problem in selecting radio button in selenium RCproblem in selecting radio button in selenium RCjitin singh30-03-20121
Unable to run selenium tests for server running in backgroundUnable to run selenium tests for server running in backgroundanj2111-12-20107
Jxl.log File genrated by Maven Jxl.log File genrated by Maven Nand Kishor30-01-20130
Urgent --- how to get links under specific panel/ div/ tableUrgent --- how to get links under specific panel/ div/ tablegaveyom04-11-201119
Trouble starting Selenium RC Server 2.5.0 It starts on 32 bit windows but not on 64 bit windowsTrouble starting Selenium RC Server 2.5.0 It starts on 32 bit windows but not on 64 bit windowsPilot_Riaz24-08-201116
trouble finding element with xpathtrouble finding element with xpathimfaus08-05-20122
user-extensions.js file is neededuser-extensions.js file is neededabhayshankar22-02-20124
Unexpected internal c-tree(R) error #7716Unexpected internal c-tree(R) error #7716Frostybyte14-02-201011
How to chose dropdown values in Selenium IDE?How to chose dropdown values in Selenium IDE?manudua16-03-20122
wrong number of arguments provided in nunitwrong number of arguments provided in nunitNithya Iyappan06-02-20140
Command openWindow(url, ID) errors out in IE9. Works fine in Firefox 9.Command openWindow(url, ID) errors out in IE9. Works fine in Firefox 9.estrellab61227-06-20120
Grabbing the current URL and storing it as a string. Grabbing the current URL and storing it as a string. ramsen18-01-20113
Problem in playing GTA San Andreas, no Audio card.Problem in playing GTA San Andreas, no Audio card.jairus28-02-20099
Unable to connect to host 127.0.0.1 on port 7055Unable to connect to host 127.0.0.1 on port 7055gaveyom10-01-20121
WinReducer 10.0 - Beta Test BuildsWinReducer 10.0 - Beta Test Buildswinterstorm205001-10-2014101
Unable to run TestNG Testcase in Eclipse by using Mozilla BrowserUnable to run TestNG Testcase in Eclipse by using Mozilla BrowserJeeva patrose12-06-20121
Selenium webdriver Error - "Could not contact Selenium Server".Selenium webdriver Error - "Could not contact Selenium Server".mins.ghodake@gmail.com19-11-20121
How to take the screen shot? when i set a kwargs, it is showing error... when i not set kwargs it is coming black color as backgroundHow to take the screen shot? when i set a kwargs, it is showing error... when i not set kwargs it is coming black color as backgroundgchandrasekaran8219-02-20113
driver.manage.timeouts.implicitwait method gives error while compiling through antdriver.manage.timeouts.implicitwait method gives error while compiling through antpass12327-02-20123
Creating the account (URL) globally and using that variable where ever it neededCreating the account (URL) globally and using that variable where ever it neededyoursjcp08-12-20102
ERROR CODE FCC74B77-EC3E-4DD8-A80B-008A702075A9ERROR CODE FCC74B77-EC3E-4DD8-A80B-008A702075A9walker12116-02-201013
Query - web driver element click is not workingQuery - web driver element click is not workingaks30-01-20116
Security Alert with yes, no, view certificate buttonSecurity Alert with yes, no, view certificate buttonAdviser26-08-20091
Warning -> Failed to start: SocketListener , while performing Cross Browser Testing Warning -> Failed to start: SocketListener , while performing Cross Browser Testing yuvasakthip19-07-20113
OpenQA.Selenium.NoSuchElementException : Unable to find elementOpenQA.Selenium.NoSuchElementException : Unable to find elementDjaved16-02-20121
How to use storetext and verify text? It is failing for me..How to use storetext and verify text? It is failing for me..gchandrasekaran8217-02-20112
Windows could not collect information for [OSImage] since the specified image file [install.wim] does not existWindows could not collect information for [OSImage] since the specified image file [install.wim] does not existdumbest27-10-20157
Getting main" org.openqa.selenium.WebDriverException: Cannot find firefox binary in PATHGetting main" org.openqa.selenium.WebDriverException: Cannot find firefox binary in PATHqajanaki06-11-20133
verifyTrue (FALSE) causes AssertionError: nullverifyTrue (FALSE) causes AssertionError: nullstacaz23-06-20105
Error:java.lang.NoClassDefFoundError: com/google/common/base/CharsetsError:java.lang.NoClassDefFoundError: com/google/common/base/Charsetsbansal.vikas124-05-20120
Results 101 to 179 on 179 for
"sims 4 initialization error at startup"
Active topics
Active topics
Popular topics
Popular topics
Unanswered topics
Unanswered topics
Pages
12